{"text_format":"1","workbook":"xlsx","n_sheets":10,"sheets":["gl. til nyt niveau","reguleringsprocenter","Lønark","Forside","Omregner","Omregningstabel ","Tillæg_trin","Tillæg_kr","Samlet_omk","Tid op_ned"],"not_rendered":{"charts":0,"images":9,"macros":1,"external_links":0,"defined_names":75,"comments":1,"pivot_tables":0},"unopened":[],"bounds":{"document_bytes":16777216,"sheet_cells":100000,"rows_first":2000,"rows_last":500,"rows_between":2000,"halvings":0,"cell_chars":16384,"cell_head_chars":4096},"cells_cut":0,"cells_raw":0,"read":"whole","date_system":"1900"}

{"sheet":"gl. til nyt niveau","index":0,"n_rows":395,"n_cols":6,"rows_kept":395,"cut":false,"hidden":true,"merged":[]}
[null,1.3980790000000001]
[null,null,null,"Nyt grundbeløb","Nyt grundbeløb"]
["Grundbeløb pr. 1/10-1984","I alt pr. 1. april 1999 inkl. %regulering",null,"pr. 31/3-2000","pr. 31/3-2000"]
[null,null,null,"ekskl. afrunding","inkl. afrunding"]
[null,null,null,null,null,"beløb"]
[null,"pr. gang/år","pr. måned",null,null,"+/-"]
[1.63,{"$f":"IF(A7<1000,$B$1*A7,ROUND($B$1*A7,0))","v":2.2788687699999999},null,{"$f":"B7","v":2.2788687699999999},{"$f":"IF(D7<1000,D7,ROUND(D7,-2))","v":2.2788687699999999}]
[5,6.9903950000000004,null,{"$f":"B8","v":6.9903950000000004},6.9903950000000004]
[5.8,8.1088582000000002,null,8.1088582000000002,8.1088582000000002]
[9,12.582711,null,12.582711,12.582711]
[10.5,14.6798295,null,14.6798295,14.6798295]
[12.22,17.084525380000002,null,17.084525380000002,17.084525380000002]
[12.65,17.68569935,null,17.68569935,17.68569935]
[13.39,18.720277810000002,null,18.720277810000002,18.720277810000002]
[13.75,19.22358625,null,19.22358625,19.22358625]
{"$rows_left_out":381}
{"sheet":"reguleringsprocenter","index":1,"n_rows":29,"n_cols":4,"rows_kept":29,"cut":false,"hidden":true,"merged":[]}
[]
[null,"Reguleringsprocenter",null,"pensionsudbygning"]
[null,"Valgt:",{"$f":"VLOOKUP(Forside!K11,reguleringsprocenter!B4:D15,2,TRUE)","v":1.456933}]
[null,"2019-04-01",1.3772530000000001,1]
[null,"2019-10-01",1.3908609999999999,1]
[null,"2020-01-01",1.4124110000000001,1]
[null,"2020-04-01",1.4177979999999999,1]
[null,"2020-10-01",1.4285110000000001,1]
[null,"2021-04-01",1.442796,1]
[null,"2021-10-01",1.456933,1]
[null,"2022-04-01",1.456933,1]
[null,"2022-10-01",1.4940180000000001,1]
[null,"2023-04-01",1.4983040000000001,1]
[null,null,null,1]
[]
{"$rows_left_out":15}
{"sheet":"Lønark","index":2,"n_rows":71,"n_cols":88,"rows_kept":71,"cut":false,"hidden":true,"merged":[]}
[1,2,3,4,5,6,7,8,9,10,11,12,13,14,15,16,17,18,19,20,21,22,23,24,25,26,27,28,29,30,31,32,33,34,35,36,37,38,39,40,41,42,43,44,45,46,47,48,49,50,51,52,53,54,55,56]
["Næstved",null,null,null,null,null,null,null,null,null,null,null,null,null,null,null,null,null,null,null,null,null,null,"Løn","Årsløn",null,null,"Ureguleret ikke-pensionsgivende tillæg",null,null,null,"Årsløn ialt ",null,null,null,null,null,null,null,null,null,null,null,null,null,null,null,null,null,null,null,null,null,null,null,null,null,null,null,null,null,null,null,null,null,null,null,null,null,null,null,null,null,null,null,null,null,null,null,null,null,null,null,null,null,"Lavtlønsprojekt"]
[null,null,null,null,null,null,null,null,null,null,null,null,null,null,null,null,null,null,null,null,null,null,null,"Løn","Årsløn",null,null,"Ureguleret ikke-pensionsgivende tillæg",null,null,null,null,null,null,null,null,null,"Områdetillæg inkl. regulering",null,null,null,null,"Årsløn ialt ",null,null,null,null,null,"Pensionsgivende løn",null,null,null,null,null,null,null,null,"Pensionsgivende løn",null,null,null,null,null,"Løn","timelønninger",null,null,null,null,null,"Løn","timelønninger + 50%",null,null,null,null,null,"Løn","søndagstillæg - 50%",null,null,null,null,null,null,"2019-03-31",0,0]
[null,"Månedsløn, løngrupper",null,null,"Lønniveau:",{"$f":"VLOOKUP(beregningsdato,regpct_tabel,1,TRUE)","v":"2022-04-01"},null,"Optrapning fra:",null,null,null,null,"Pensionsgivende løn",null,null,null,null,null,"Pensionsgivende løn, optrapning fra:",null,null,null,null,"trin","Grundsats","%-reg.","Sats","Omr 1","Omr 2","Omr 3","Omr 4",null,null,null,null,null,null,1,2,3,4,null,"Omr 0","Omr 1","Omr 2","Omr 3","Omr 4",null,"Grundsats","%-reg.","Sats",null,"Pensionsudbygningspct:",null,null,{"$f":"VLOOKUP(F4,regpct_tabel,3,FALSE)","v":1},null,"Omr 0","Omr 1","Omr 2","Omr 3","Omr 4",null,"trin","Omr 0","Omr 1","Omr 2","Omr 3","Omr 4",null,"trin","Omr 0","Omr 1","Omr 2","Omr 3","Omr 4",null,"trin","Omr 0","Omr 1","Omr 2","Omr 3","Omr 4",null,null,"2019-04-01",382,0]
[null,0,1,2,3,4,null,"0->1","1->2","2->3",null,null,0,1,2,3,4,null,"0->1","1->2","2->3","3->4",null,null,{"$f":"VLOOKUP(beregningsdato,Lavtløn,2,TRUE)","v":1035},{"$f":"valgt_regulering-1","v":0.45693300000000003},"2019-04-01","2022-04-01",{"$f":"VLOOKUP(beregningsdato,Lavtløn,3,TRUE)","v":653},null,null,null,null,null,null,null,null,{"$f":"IF(beregningsdato<40087,0,regulering)","v":0.45693300000000003},{"$f":"IF(beregningsdato<40087,0,5)","v":5},null,null,null,null,null,null,null,null,null,null,null,null,null,null,null,null,null,null,null,null,null,null,null,null,null,null,null,null,null,null,null,null,null,null,null,null,null,null,null,null,null,null,null,null,null,null,"2022-04-01",{"$f":"CI4+CJ5","v":1035},653]
[1,{"$f":"AQ6/12","v":17871},18123.75,18298.75,18551.666666666668,18726.583333333332,null,{"$f":"ROUND(AQ6+(AR6-AQ6)/3*faktor,0)/12","v":19101759.75},{"$f":"ROUND(AR6+(AS6-AR6)/3*faktor,0)/12","v":13231498.75},{"$f":"ROUND(AS6+(AT6-AS6)/3*faktor,0)/12","v":19114771.666666668},null,1,{"$f":"BF6/12","v":17871},18123.75,18298.75,18551.666666666668,18726.583333333332,null,{"$f":"(BF6+ROUND((BG6-BF6)/3*faktor,0))/12","v":19101759.75},{"$f":"(BG6+ROUND((BH6-BG6)/3*faktor,0))/12","v":13231498.75},{"$f":"(BH6+ROUND((BI6-BH6)/3*faktor,0))/12","v":19114771.666666668},{"$f":"(BI6+ROUND((BJ6-BI6)/3*faktor,0))/12","v":13225634.583333334},null,1,147194,{"$f":"ROUND(Y6*regulering,0)","v":67258},{"$f":"Y6+Z6","v":214452},2585,4374,6959,8748,null,2082,3523,5606,7047,null,{"$f":"ROUND(VLOOKUP($X6,$X:$AJ,(4+AL$4)+$AM$5)*(1+$AL$5),0)","v":3033},5133,8168,10267,null,{"$f":"$AA6","v":214452},{"$f":"$AA6+AL6","v":217485},219585,222620,224719,null,147194,{"$f":"AW6*regulering","v":67257.796002000003},{"$f":"ROUND(SUM(AW6:AX6),0)","v":214452},null,{"$f":"ROUND(AL6*udbygningspct,0)","v":3033},{"$f":"ROUND(AM6*udbygningspct,0)","v":5133},{"$f":"ROUND(AN6*udbygningspct,0)","v":8168},{"$f":"ROUND(AO6*udbygningspct,0)","v":10267},null,{"$f":"AY6","v":214452},{"$f":"$BF6+BA6","v":217485},{"$f":"$BF6+BB6","v":219585},222620,224719,null,1,{"$f":"AQ6/1924","v":111.46153846153847},113.03794178794179,114.12941787941789,115.70686070686071,116.79781704781705,null,1,{"$f":"AQ6/1924*1.5","v":167.19230769230771},{"$f":"AR6/1924*1.5","v":169.55691268191268},{"$f":"AS6/1924*1.5","v":171.19412681912684},{"$f":"AT6/1924*1.5","v":173.56029106029106},{"$f":"AU6/1924*1.5","v":175.19672557172558},null,1,{"$f":"AQ6/1924/2","v":55.730769230769234},56.518970893970895,57.064708939708943,57.853430353430355,58.398908523908524]
[2,18145.5,18404.5,18583.666666666668,18842.666666666668,19021.833333333332,null,19573940.5,13546383.666666666,19574378.666666668,null,2,18145.5,18404.5,18583.666666666668,18842.666666666668,19021.833333333332,null,19573940.5,13546383.666666666,19574378.666666668,13546821.833333334,null,2,149455,68291,217746,2648,4481,7128,8961,null,2133,3609,5742,7218,null,3108,5258,8366,10516,null,{"$f":"$AA7","v":217746},220854,223004,226112,228262,null,149455,{"$f":"AW7*regulering","v":68290.921515000009},{"$f":"ROUND(SUM(AW7:AX7),0)","v":217746},null,3108,5258,8366,10516,null,{"$f":"AY7","v":217746},220854,223004,226112,228262,null,2,113.17359667359668,114.78898128898129,115.9064449064449,117.52182952182952,118.63929313929314,null,2,{"$f":"AQ7/1924*1.5","v":169.76039501039503},172.18347193347194,173.85966735966736,176.28274428274426,177.95893970893971,null,2,56.586798336798338,57.394490644490645,57.953222453222452,58.760914760914758,59.319646569646572]
[3,18427.416666666668,18692.583333333332,18876.25,19141.416666666668,19325.25,null,20039836.583333332,13886444.25,20040285.416666668,null,3,18427.416666666668,18692.583333333332,18876.25,19141.416666666668,19325.25,null,20039836.583333332,13886444.25,20040285.416666668,13899477.25,null,3,151777,69352,221129,2711,4590,7301,9180,null,2184,3697,5881,7395,null,3182,5386,8568,10774,null,221129,224311,226515,229697,231903,null,151777,69351.919941,221129,null,3182,5386,8568,10774,null,221129,224311,226515,229697,231903,null,3,114.93191268191268,116.58575883575884,117.73128898128898,119.38513513513513,120.53170478170478,null,3,172.39786902286903,174.87863825363826,176.59693347193348,179.07770270270271,180.79755717255716,null,3,57.465956340956339,58.292879417879419,58.865644490644492,59.692567567567565,60.265852390852388]
[4,18717.083333333332,18988.916666666668,19177,19448.833333333332,19636.916666666668,null,20543492.916666668,14220221,20543952.833333332,null,4,18717.083333333332,18988.916666666668,19177,19448.833333333332,19636.916666666668,null,20543492.916666668,14220221,20543952.833333332,14220680.916666666,null,4,154163,70442,224605,2779,4703,7482,9405,null,2239,3788,6027,7576,null,3262,5519,8781,11038,null,224605,227867,230124,233386,235643,null,154163,70442.162079000002,224605,null,3262,5519,8781,11038,null,224605,227867,230124,233386,235643,null,4,116.73856548856548,118.43399168399168,119.60706860706861,121.30249480249481,122.47557172557173,null,4,175.10784823284823,177.65098752598752,179.4106029106029,181.95374220374219,183.71335758835758,null,4,58.369282744282742,59.216995841995839,59.803534303534306,60.651247401247403,61.237785862785863]
[5,19014.666666666668,19293.083333333332,19486,19764.416666666668,19957.083333333332,null,21040865.083333332,14585466,21041336.416666668,null,5,19014.666666666668,19293.083333333332,19486,19764.416666666668,19957.083333333332,null,21040865.083333332,14585466,21041336.416666668,14567061.083333334,null,5,156614,71562,228176,2847,4819,7666,9636,null,2293,3882,6175,7762,null,3341,5656,8997,11309,null,228176,231517,233832,237173,239485,null,156614,71562.104862000007,228176,null,3341,5656,8997,11309,null,228176,231517,233832,237173,239485,null,5,118.5945945945946,120.33108108108108,121.53430353430353,123.27079002079002,124.47245322245323,null,5,177.8918918918919,180.49662162162161,182.30145530145529,184.90618503118503,186.70867983367984,null,5,59.297297297297298,60.16554054054054,60.767151767151766,61.635395010395008,62.236226611226613]
[6,19320.75,19606.083333333332,19803.583333333332,20088.833333333332,20286.333333333332,null,21563414.083333332,14931843.583333334,21557604.833333332,null,6,19320.75,19606.083333333332,19803.583333333332,20088.833333333332,20286.333333333332,null,21563414.083333332,14931843.583333334,21557604.833333332,14932326.333333334,null,6,159135,72714,231849,2917,4937,7854,9873,null,2350,3977,6326,7953,null,3424,5794,9217,11587,null,231849,235273,237643,241066,243436,null,159135,72714.032955000002,231849,null,3424,5794,9217,11587,null,231849,235273,237643,241066,243436,null,6,120.50363825363826,122.28326403326403,123.51507276507276,125.29417879417879,126.52598752598753,null,6,180.75545738045739,183.42489604989606,185.27260914760913,187.94126819126819,189.78898128898129,null,6,60.251819126819129,61.141632016632016,61.757536382536379,62.647089397089395,63.262993762993766]
[7,19634.75,19927.083333333332,20129.583333333332,20422,20624.25,null,22092263.083333332,15309689.583333334,22099050,null,7,19634.75,19927.083333333332,20129.583333333332,20422,20624.25,null,22092263.083333332,15309689.583333334,22099050,15291308.25,null,7,161721,73896,235617,2989,5060,8049,10118,null,2408,4076,6484,8150,null,3508,5938,9447,11874,null,235617,239125,241555,245064,247491,null,161721,73895.661693000002,235617,null,3508,5938,9447,11874,null,235617,239125,241555,245064,247491,null,7,122.46205821205821,124.28534303534303,125.54833679833679,127.37214137214137,128.63357588357587,null,7,183.69308731808732,186.42801455301455,188.32250519750519,191.05821205821206,192.95036382536381,null,7,61.231029106029105,62.142671517671516,62.774168399168396,63.686070686070686,64.316787941787936]
[8,19969.333333333332,20269.25,20476.916666666668,20776.75,20984.333333333332,null,22665177.25,15700140.916666666,22659392.75,null,8,19969.333333333332,20269.25,20476.916666666668,20776.75,20984.333333333332,null,22665177.25,15700140.916666666,22659392.75,15694356.333333334,null,8,164477,75155,239632,3067,5190,8256,10379,null,2470,4181,6650,8360,null,3599,6091,9689,12180,null,239632,243231,245723,249321,251812,null,164477,75154.969041000004,239632,null,3599,6091,9689,12180,null,239632,243231,245723,249321,251812,null,8,124.54885654885655,126.41943866943868,127.71465696465697,129.58471933471932,130.87941787941787,null,8,186.82328482328484,189.629158004158,191.57198544698545,194.37707900207897,196.31912681912681,null,8,62.274428274428274,63.209719334719338,63.857328482328484,64.792359667359662,65.439708939708936]
[9,20597.5,20904.916666666668,21117.666666666668,21424.916666666668,21637.75,null,{"$f":"ROUND(AQ14+(AR14-AQ14)/3*faktor,0)/12","v":23232092.916666668},{"$f":"ROUND(AR14+(AS14-AR14)/3*faktor,0)/12","v":16084593.666666666},{"$f":"ROUND(AS14+(AT14-AS14)/3*faktor,0)/12","v":23220028.916666668},null,9,20597.5,20904.916666666668,21117.666666666668,21424.916666666668,21637.75,null,{"$f":"(BF14+ROUND((BG14-BF14)/3*faktor,0))/12","v":23232092.916666668},{"$f":"(BG14+ROUND((BH14-BG14)/3*faktor,0))/12","v":16084593.666666666},{"$f":"(BH14+ROUND((BI14-BH14)/3*faktor,0))/12","v":23220028.916666668},{"$f":"(BI14+ROUND((BJ14-BI14)/3*faktor,0))/12","v":16091405.75},null,9,169651,77519,247170,3143,5319,8461,10637,null,2532,4284,6815,8568,null,3689,6242,9929,12483,{"$f":"AR14/12","v":20904.916666666668},247170,{"$f":"ROUND($AA14+AL14,0)","v":250859},{"$f":"$AA14+AM14","v":253412},{"$f":"$AA14+AN14","v":257099},{"$f":"$AA14+AO14","v":259653},null,169651,77519.140383000005,247170,null,3689,6242,9929,12483,null,247170,250859,253412,257099,259653,null,9,128.46673596673597,130.38409563409564,131.71101871101871,133.62733887733887,134.95478170478171,null,9,192.70010395010394,195.57614345114348,197.56652806652806,200.44100831600832,202.43217255717258,null,9,64.233367983367984,65.192047817047822,65.855509355509355,66.813669438669436,67.477390852390855]
[10,20743,21058.083333333332,21276.083333333332,21591.083333333332,21809.25,null,23811110.083333332,16481148.083333334,23805351.083333332,null,10,20743,21058.083333333332,21276.083333333332,21591.083333333332,21809.25,null,23811110.083333332,16481148.083333334,23805351.083333332,16494265.25,null,10,170849,78067,248916,3221,5451,8672,10903,null,2595,4391,6985,8782,null,3781,6397,10177,12795,null,248916,{"$f":"$AA15+AL15","v":252697},255313,259093,261711,null,170849,78066.546117000005,248916,null,3781,6397,10177,12795,null,248916,252697,255313,259093,261711,null,10,129.37422037422039,131.3393970893971,132.69906444906445,134.66372141372142,136.02442827442829,null,10,194.06133056133058,197.00909563409564,199.04859667359668,201.99558212058213,204.03664241164245,null,10,64.687110187110193,65.669698544698548,66.349532224532226,67.331860706860709,68.012214137214144]
{"$rows_left_out":57}
{"sheet":"Forside","index":3,"n_rows":15,"n_cols":11,"rows_kept":15,"cut":false,"hidden":false,"merged":[[14,3,14,7]]}
[]
[]
[]
[]
[]
[]
[]
[]
[]
[]
[null,null,null,null,null,null,null,null,null,"Lønniveau:","2022-04-01"]
[]
[]
[]
[null,null,null,"Hvad betyder det for lønnen, hvis man ændrer på lønsammensætning eller timetal ?"]
{"$rows_left_out":1}
{"sheet":"Omregner","index":4,"n_rows":24,"n_cols":9,"rows_kept":24,"cut":false,"hidden":false,"merged":[]}
[]
[]
[]
[]
[]
[]
[]
[]
[]
[]
[null,null,null,"Valgt lønniveau:",null,{"$f":"Forside!K11","v":"2022-04-01"},null,"Timetal:",37]
[]
[null,"1) Grundbeløb pr. 31-3-2000 omregnet til nutidskr. "]
[null,null,"Årligt grundbeløb:",null,11300]
[]
{"$rows_left_out":10}
{"sheet":"Omregningstabel ","index":5,"n_rows":25,"n_cols":16,"rows_kept":25,"cut":false,"hidden":true,"merged":[]}
[null,null,null,1.362716,1.3824959999999999,1.3980790000000001,1.018559,1.040662,1.0511569999999999,1.061566,1.0834220000000001,1.0886800000000001,1.0926750000000001,1.109523,1.1200380000000001,1.1244540000000001]
[]
[]
[]
[]
[]
[null,"Indtast beløb:",1000]
[]
[]
[null,null,"1/10 '84"]
[null,null,{"$f":"Beløb","v":1000},"1/4 '98"]
[null,"1/4-98",{"$f":"Beløb*_1_4_1998","v":1362.7160000000001},{"$f":"Beløb","v":1000},"1/10 '98"]
[null,"1/10-98",{"$f":"Beløb*_1_10_1998","v":1382.4959999999999},{"$f":"Beløb/_1_4_1998*_1_10_1998","v":1014.515130078461},{"$f":"Beløb","v":1000},"1/4 '99"]
[null,"1/4-99",{"$f":"Beløb*_1_4_1999","v":1398.0790000000002},{"$f":"Beløb/_1_4_1998*_1_4_1999","v":1025.9503814441161},{"$f":"Beløb/_1_10_1998*_1_4_1999","v":1011.2716420156008},{"$f":"Beløb","v":1000}]
[null,"Grundbeløb pr. 31/3-00",{"$f":"ROUND(C14,-2)","v":1400},{"$f":"ROUND(D14,-2)","v":1000},{"$f":"ROUND(E14,-2)","v":1000},{"$f":"ROUND(F14,-2)","v":1000},"1/4 '00"]
{"$rows_left_out":11}
{"sheet":"Tillæg_trin","index":6,"n_rows":16,"n_cols":4,"rows_kept":16,"cut":false,"hidden":true,"merged":[[1,1,1,7]]}
[3]
[]
[null,"Valgt lønniveau: ",{"$f":"Forside!K11","v":"2022-04-01"}]
[]
[null,"Løngruppe",null,3]
[null,"Timer/uge",null,37]
[null,"Pensions-% inkl. evt. fritvalgs-%",null,13.89]
[null,"Særlig feriegodtgørelse, aktuel pct.",null,1.95]
[]
[null,"Stigning:","Fra","Til"]
[null,"Løntrin ",18,19]
[]
[null,"Løn",{"$f":"(VLOOKUP(til_trin,Lønark!A5:F61,løngruppe+2,FALSE)-VLOOKUP(fra_trin,Lønark!A5:F61,løngruppe+2,FALSE))/37*timetal*12","v":4143.9999999999854}]
[null,"Pension inkl. evt. fritvalgstillæg",{"$f":"(VLOOKUP(til_trin,Lønark!L5:Q61,løngruppe+2,FALSE)-VLOOKUP(fra_trin,Lønark!L5:Q61,løngruppe+2,FALSE))/37*timetal*pensionsstatus%*12","v":575.60159999999792}]
[null,"Ferietillæg",{"$f":"ferie_pct%*C13","v":80.807999999999723}]
{"$rows_left_out":2}
{"sheet":"Tillæg_kr","index":7,"n_rows":15,"n_cols":4,"rows_kept":15,"cut":false,"hidden":true,"merged":[[9,1,9,2]]}
[2]
[]
[null,null,"Valgt lønniveau:",{"$f":"Forside!K11","v":"2022-04-01"}]
[]
[{"$f":"VLOOKUP(dummy,reg_procenter,2,FALSE)","v":{"$error":"#NAME?"}},null,"Årligt beløb, 31.3.2000 niveau ",12900]
[null,null,"Timer/uge",30]
[null,null,"Pension-% inkl. evt. fritvalgs-%",13.89]
[null,null,"Særlig feriegodtg., aktuel pct.",1.95]
[]
[]
[null,null,"bruttoudgift / år","bruttoudgift / md"]
[null,"Løn",{"$f":"kr*valgt_regulering/37*timetal","v":15238.731648648649},{"$f":"beløb/12","v":1269.8943040540541}]
[null,"Pension inkl. evt. fritvalgstillæg",{"$f":"beløb*pensionsstatus%","v":2116.659825997297},{"$f":"C13/12","v":176.38831883310809}]
[null,"Ferietillæg",{"$f":"D8%*(C12)","v":297.15526714864865},{"$f":"C14/12","v":24.762938929054055}]
[null,"Bruttoudgift i alt",{"$f":"ROUND(SUM(C12:C14),0)","v":17653},{"$f":"ROUND(SUM(D12:D14),0)","v":1471}]
{"$rows_left_out":1}
{"sheet":"Samlet_omk","index":8,"n_rows":26,"n_cols":3,"rows_kept":26,"cut":false,"hidden":false,"merged":[]}
[2,"Valgt lønniveau: ",{"$f":"Forside!K11","v":"2022-04-01"}]
[]
[null,"Løngruppe",0]
[null,"Timer/uge",37]
[null,"Pensions-% inkl. evt. fritvalgs-%",13.89]
[null,"Særlig feriegodtgørelse, aktuel pct.",1.95]
[]
[null,"Løntrin ",21]
[]
[null,"Reguleret tillæg (31.3.2000) kr./år",12000]
[]
[]
[null,"Løn/time",{"$f":"IFERROR(ROUND(VLOOKUP(fra_trin,Lønark!A5:AU61,løngruppe+43,FALSE)/1924,2)+ROUND(C10*valgt_regulering/1924,2),ROUND(C10*valgt_regulering/1924,2))","v":163.52000000000001}]
[null,"Pension inkl. evt. fritvalgstillæg",{"$f":"C13*pensionsstatus%","v":22.712928000000002}]
[null,"Ferietillæg",{"$f":"C6%*C13","v":3.1886400000000004}]
{"$rows_left_out":12}
{"sheet":"Tid op_ned","index":9,"n_rows":31,"n_cols":8,"rows_kept":31,"cut":false,"hidden":false,"merged":[]}
[2,"Valgt lønniveau: ",{"$f":"Forside!K11","v":"2022-04-01"}]
[]
[null,"Grundoplysninger:"]
[null,"Løngruppe",0]
[null,"Pensions-% inkl. evt. fritvalgs-%",12.94]
[null,"Særlig feriegodtgørelse, aktuel procent",1.95]
[]
[]
[null,"Lønsammensætning (trin i alt og grundbeløb i alt)","Før ændring",null,"Efter ændring"]
[]
[null,"Løndele:","I alt"]
[]
[null,"Løntrin - centralt og lokalt aftalte",33,null,33]
[]
[null,"Tillæg (grundbeløb 31.3.2000) kr./år centralt og lokalt aftalte",null,null,11300]
{"$rows_left_out":16}